Reaction Details
TargetCorticotropin-releasing factor receptor 1
LigandBDBM50232178
Substrate/Competitorn/a
Meas. Tech.ChEBML_1646196
Ki 1.7±n/a nM
Citation Cherukupalli, SKarpoormath, RChandrasekaran, BHampannavar, GAThapliyal, NPalakollu, VN An insight on synthetic and medicinal aspects of pyrazolo[1,5-a]pyrimidine scaffold. Eur J Med Chem126:298-352 (2017) 
 
Corticotropin-releasing factor receptor 1
Name:Corticotropin-releasing factor receptor 1
Type:Enzyme
Mol. Mass.:50744.31
Organism:Homo sapiens (Human)
Description:P34998
Residue:444
BDBM50232178
NameBDBM50232178
Synonyms:CHEMBL4081285
TypeSmall organic molecule
Emp. Form.C20H25ClN4
Mol. Mass.356.892
SMILESCCC(CC)Nc1cc(C)nc2c(c(C)nn12)-c1ccc(Cl)cc1C