Reaction Details
TargetProtein mono-ADP-ribosyltransferase PARP3
LigandBDBM50145156
Substrate/Competitorn/a
Meas. Tech.ChEBML_1646306
IC50 63±n/a nM
Citation Thorsell, AGEkblad, TKarlberg, TLöw, MPinto, AFTrésaugues, LMoche, MCohen, MSSchüler, H Structural Basis for Potency and Promiscuity in Poly(ADP-ribose) Polymerase (PARP) and Tankyrase Inhibitors. J Med Chem60:1262-1271 (2017) 
 
Protein mono-ADP-ribosyltransferase PARP3
Name:Protein mono-ADP-ribosyltransferase PARP3
Type:PROTEIN
Mol. Mass.:60091.40
Organism:Homo sapiens (Human)
Description:ChEMBL_109545
Residue:533
BDBM50145156
NameBDBM50145156
Synonyms:CHEMBL3764816
TypeSmall organic molecule
Emp. Form.C19H14F2N6O
Mol. Mass.380.3509
SMILESCn1ncnc1[C@H]1[C@@H](Nc2cc(F)cc3c2c1n[nH]c3=O)c1ccc(F)cc1