Reaction Details
TargetProtein mono-ADP-ribosyltransferase PARP10
LigandBDBM50232347
Substrate/Competitorn/a
Meas. Tech.ChEMBL_1646311 (CHEMBL3995367)
IC50 7100±n/a nM
Citation Thorsell, AGEkblad, TKarlberg, TLöw, MPinto, AFTrésaugues, LMoche, MCohen, MSSchüler, H Structural Basis for Potency and Promiscuity in Poly(ADP-ribose) Polymerase (PARP) and Tankyrase Inhibitors. J Med Chem60:1262-1271 (2017) 
 
Protein mono-ADP-ribosyltransferase PARP10
Name:Protein mono-ADP-ribosyltransferase PARP10
Type:n/a
Mol. Mass.:109953.63
Organism:Homo sapiens (Human)
Description:Q53GL7
Residue:1025
BDBM50232347
NameBDBM50232347
Synonyms:CHEMBL4089840
TypeSmall organic molecule
Emp. Form.C17H13NO3
Mol. Mass.279.29
SMILESO=C(COc1cccc2c1cc[nH]c2=O)c1ccccc1