Reaction Details
TargetPoly [ADP-ribose] polymerase tankyrase-2
LigandBDBM50188594
Substrate/Competitorn/a
Meas. Tech.ChEBML_1646310
IC50 5.25±n/a nM
Citation Thorsell, AGEkblad, TKarlberg, TLöw, MPinto, AFTrésaugues, LMoche, MCohen, MSSchüler, H Structural Basis for Potency and Promiscuity in Poly(ADP-ribose) Polymerase (PARP) and Tankyrase Inhibitors. J Med Chem60:1262-1271 (2017) 
 
Poly [ADP-ribose] polymerase tankyrase-2
Name:Poly [ADP-ribose] polymerase tankyrase-2
Type:Enzyme
Mol. Mass.:126937.16
Organism:Homo sapiens (Human)
Description:Q9H2K2
Residue:1166
BDBM50188594
NameBDBM50188594
Synonyms:CHEBI:62878 | CHEMBL1086580
TypeSmall organic molecule
Emp. Form.C14H11F3N2OS
Mol. Mass.312.31
SMILESOc1nc(nc2CCSCc12)-c1ccc(cc1)C(F)(F)F