Reaction Details
TargetPoly [ADP-ribose] polymerase 2
LigandBDBM50188594
Substrate/Competitorn/a
Meas. Tech.ChEMBL_1646322 (CHEMBL3995378)
IC50 114±n/a nM
Citation Thorsell, AGEkblad, TKarlberg, TLöw, MPinto, AFTrésaugues, LMoche, MCohen, MSSchüler, H Structural Basis for Potency and Promiscuity in Poly(ADP-ribose) Polymerase (PARP) and Tankyrase Inhibitors. J Med Chem60:1262-1271 (2017) 
 
Poly [ADP-ribose] polymerase 2
Name:Poly [ADP-ribose] polymerase 2
Type:Enzyme
Mol. Mass.:66225.70
Organism:Homo sapiens (Human)
Description:Q9UGN5
Residue:583
BDBM50188594
NameBDBM50188594
Synonyms:CHEBI:62878 | CHEMBL1086580
TypeSmall organic molecule
Emp. Form.C14H11F3N2OS
Mol. Mass.312.31
SMILESOc1nc(nc2CCSCc12)-c1ccc(cc1)C(F)(F)F