Reaction Details
TargetProtein mono-ADP-ribosyltransferase PARP15
LigandBDBM50446130
Substrate/Competitorn/a
Meas. Tech.ChEMBL_1646315 (CHEMBL3995371)
IC50 32600±n/a nM
Citation Thorsell, AGEkblad, TKarlberg, TLöw, MPinto, AFTrésaugues, LMoche, MCohen, MSSchüler, H Structural Basis for Potency and Promiscuity in Poly(ADP-ribose) Polymerase (PARP) and Tankyrase Inhibitors. J Med Chem60:1262-1271 (2017) 
 
Protein mono-ADP-ribosyltransferase PARP15
Name:Protein mono-ADP-ribosyltransferase PARP15
Type:n/a
Mol. Mass.:74595.89
Organism:Homo sapiens (Human)
Description:Q460N3
Residue:678
BDBM50446130
NameBDBM50446130
Synonyms:AG-014699 RUCAPARIB CAMSYLATE | Rucaparib
TypeSmall organic molecule
Emp. Form.C19H18FN3O
Mol. Mass.323.3641
SMILESCNCc1ccc(cc1)-c1[nH]c2cc(F)cc3C(=O)NCCc1c23