Reaction Details
TargetProtein mono-ADP-ribosyltransferase PARP14
LigandBDBM27135
Substrate/Competitorn/a
Meas. Tech.ChEBML_1646314
IC50 89125±n/a nM
Citation Thorsell, AGEkblad, TKarlberg, TLöw, MPinto, AFTrésaugues, LMoche, MCohen, MSSchüler, H Structural Basis for Potency and Promiscuity in Poly(ADP-ribose) Polymerase (PARP) and Tankyrase Inhibitors. J Med Chem60:1262-1271 (2017) 
 
Protein mono-ADP-ribosyltransferase PARP14
Name:Protein mono-ADP-ribosyltransferase PARP14
Type:n/a
Mol. Mass.:202812.41
Organism:Homo sapiens (Human)
Description:Q460N5
Residue:1801
BDBM27135
NameBDBM27135
Synonyms:2-[(2R)-2-methylpyrrolidin-2-yl]-1H-1,3-benzodiazole-4-carboxamide benzimidazole carboxamide, 3a
TypeSmall organic molecule
Emp. Form.C13H16N4O
Mol. Mass.244.2923
SMILESC[C@@]1(CCCN1)c1nc2cccc(C(N)=O)c2[nH]1