Reaction Details
TargetProtein mono-ADP-ribosyltransferase PARP14
LigandBDBM50145156
Substrate/Competitorn/a
Meas. Tech.ChEBML_1646314
IC50 25119±n/a nM
Citation Thorsell, AGEkblad, TKarlberg, TLöw, MPinto, AFTrésaugues, LMoche, MCohen, MSSchüler, H Structural Basis for Potency and Promiscuity in Poly(ADP-ribose) Polymerase (PARP) and Tankyrase Inhibitors. J Med Chem60:1262-1271 (2017) 
 
Protein mono-ADP-ribosyltransferase PARP14
Name:Protein mono-ADP-ribosyltransferase PARP14
Type:n/a
Mol. Mass.:202812.41
Organism:Homo sapiens (Human)
Description:Q460N5
Residue:1801
BDBM50145156
NameBDBM50145156
Synonyms:CHEMBL3764816
TypeSmall organic molecule
Emp. Form.C19H14F2N6O
Mol. Mass.380.3509
SMILESCn1ncnc1[C@H]1[C@@H](Nc2cc(F)cc3c2c1n[nH]c3=O)c1ccc(F)cc1