Reaction Details
TargetPoly [ADP-ribose] polymerase tankyrase-1
LigandBDBM27135
Substrate/Competitorn/a
Meas. Tech.ChEMBL_1646308 (CHEMBL3995364)
IC50 10715±n/a nM
Citation Thorsell, AGEkblad, TKarlberg, TLöw, MPinto, AFTrésaugues, LMoche, MCohen, MSSchüler, H Structural Basis for Potency and Promiscuity in Poly(ADP-ribose) Polymerase (PARP) and Tankyrase Inhibitors. J Med Chem60:1262-1271 (2017) 
 
Poly [ADP-ribose] polymerase tankyrase-1
Name:Poly [ADP-ribose] polymerase tankyrase-1
Type:Enzyme
Mol. Mass.:142058.03
Organism:Homo sapiens (Human)
Description:O95271
Residue:1327
BDBM27135
NameBDBM27135
Synonyms:2-[(2R)-2-methylpyrrolidin-2-yl]-1H-1,3-benzodiazole-4-carboxamide benzimidazole carboxamide, 3a
TypeSmall organic molecule
Emp. Form.C13H16N4O
Mol. Mass.244.2923
SMILESC[C@@]1(CCCN1)c1nc2cccc(C(N)=O)c2[nH]1