Reaction Details
TargetPoly [ADP-ribose] polymerase tankyrase-1
LigandBDBM50232346
Substrate/Competitorn/a
Meas. Tech.ChEMBL_1646308 (CHEMBL3995364)
IC50 100±n/a nM
Citation Thorsell, AGEkblad, TKarlberg, TLöw, MPinto, AFTrésaugues, LMoche, MCohen, MSSchüler, H Structural Basis for Potency and Promiscuity in Poly(ADP-ribose) Polymerase (PARP) and Tankyrase Inhibitors. J Med Chem60:1262-1271 (2017) 
 
Poly [ADP-ribose] polymerase tankyrase-1
Name:Poly [ADP-ribose] polymerase tankyrase-1
Type:Enzyme
Mol. Mass.:142058.03
Organism:Homo sapiens (Human)
Description:O95271
Residue:1327
BDBM50232346
NameBDBM50232346
Synonyms:CHEMBL4101890
TypeSmall organic molecule
Emp. Form.C25H28N6O
Mol. Mass.428.5294
SMILESC[C@H]1CN(C[C@@H](C)N1)c1cc(C)c(cn1)-c1ccc(cc1)-c1nc2n(C)ccc2c(=O)[nH]1