Reaction Details
TargetProtein mono-ADP-ribosyltransferase PARP12
LigandBDBM50446130
Substrate/Competitorn/a
Meas. Tech.ChEMBL_1646313 (CHEMBL3995369)
IC50 6650±n/a nM
Citation Thorsell, AGEkblad, TKarlberg, TLöw, MPinto, AFTrésaugues, LMoche, MCohen, MSSchüler, H Structural Basis for Potency and Promiscuity in Poly(ADP-ribose) Polymerase (PARP) and Tankyrase Inhibitors. J Med Chem60:1262-1271 (2017) 
 
Protein mono-ADP-ribosyltransferase PARP12
Name:Protein mono-ADP-ribosyltransferase PARP12
Type:PROTEIN
Mol. Mass.:79092.00
Organism:Homo sapiens (Human)
Description:ChEMBL_107665
Residue:701
BDBM50446130
NameBDBM50446130
Synonyms:AG-014699 RUCAPARIB CAMSYLATE | Rucaparib
TypeSmall organic molecule
Emp. Form.C19H18FN3O
Mol. Mass.323.3641
SMILESCNCc1ccc(cc1)-c1[nH]c2cc(F)cc3C(=O)NCCc1c23