Reaction Details
TargetProtein mono-ADP-ribosyltransferase PARP16
LigandBDBM27566
Substrate/Competitorn/a
Meas. Tech.ChEMBL_1646316 (CHEMBL3995372)
IC50 5129±n/a nM
Citation Thorsell, AGEkblad, TKarlberg, TLöw, MPinto, AFTrésaugues, LMoche, MCohen, MSSchüler, H Structural Basis for Potency and Promiscuity in Poly(ADP-ribose) Polymerase (PARP) and Tankyrase Inhibitors. J Med Chem60:1262-1271 (2017) 
 
Protein mono-ADP-ribosyltransferase PARP16
Name:Protein mono-ADP-ribosyltransferase PARP16
Type:PROTEIN
Mol. Mass.:36398.93
Organism:Homo sapiens (Human)
Description:ChEMBL_117586
Residue:322
BDBM27566
NameBDBM27566
Synonyms:4-({3-[(4-cyclopropanecarbonylpiperazin-1-yl)carbonyl]-4-fluorophenyl}methyl)-1,2-dihydrophthalazin-1-one Olaparib US10597399, Compound AZD2281 US9255106, AZD2281
TypeSmall organic molecule
Emp. Form.C24H23FN4O3
Mol. Mass.434.4628
SMILESFc1ccc(Cc2n[nH]c(=O)c3ccccc23)cc1C(=O)N1CCN(CC1)C(=O)C1CC1