Reaction Details
TargetHistone deacetylase 1
LigandBDBM50439674
Substrate/Competitorn/a
Meas. Tech.ChEMBL_1646423 (CHEMBL3995479)
IC50 58±n/a nM
Citation Nepali, KLee, HYLai, MJOjha, RWu, TYWu, GXChen, MCLiou, JP Ring-opened tetrahydro-¿-carbolines display cytotoxicity and selectivity with histone deacetylase isoforms. Eur J Med Chem127:115-127 (2017) 
 
Histone deacetylase 1
Name:Histone deacetylase 1
Type:Enzyme
Mol. Mass.:55090.27
Organism:Homo sapiens (Human)
Description:Q13547
Residue:482
BDBM50439674
NameBDBM50439674
Synonyms:RICOLINOSTAT US11207431, Example E US8609678, 2-(diphenylamino)-N-(7-(hydroxyamino)-7-oxoheptyl)pyrimidine-5-carboxamide [26]
TypeSmall organic molecule
Emp. Form.C24H27N5O3
Mol. Mass.433.5029
SMILESONC(=O)CCCCCCNC(=O)c1cnc(nc1)N(c1ccccc1)c1ccccc1