Reaction Details
TargetHistone deacetylase 1
LigandBDBM50232360
Substrate/Competitorn/a
Meas. Tech.ChEMBL_1646418 (CHEMBL3995474)
IC50 2000±n/a nM
Citation Nepali, KLee, HYLai, MJOjha, RWu, TYWu, GXChen, MCLiou, JP Ring-opened tetrahydro-¿-carbolines display cytotoxicity and selectivity with histone deacetylase isoforms. Eur J Med Chem127:115-127 (2017) 
 
Histone deacetylase 1
Name:Histone deacetylase 1
Type:Enzyme
Mol. Mass.:55090.27
Organism:Homo sapiens (Human)
Description:Q13547
Residue:482
BDBM50232360
NameBDBM50232360
Synonyms:CHEMBL4104572
TypeSmall organic molecule
Emp. Form.C20H19N3O5S
Mol. Mass.413.447
SMILESCN(C)C(=O)c1cn(c2ccccc12)S(=O)(=O)c1ccc(\C=C\C(=O)NO)cc1