Reaction Details
TargetHistone deacetylase 2
LigandBDBM50232352
Substrate/Competitorn/a
Meas. Tech.ChEMBL_1646419 (CHEMBL3995475)
IC50 1340±n/a nM
Citation Nepali, KLee, HYLai, MJOjha, RWu, TYWu, GXChen, MCLiou, JP Ring-opened tetrahydro-¿-carbolines display cytotoxicity and selectivity with histone deacetylase isoforms. Eur J Med Chem127:115-127 (2017) 
 
Histone deacetylase 2
Name:Histone deacetylase 2
Type:Chromatin regulator; hydrolase; repressor
Mol. Mass.:55356.54
Organism:Homo sapiens (Human)
Description:Q92769
Residue:488
BDBM50232352
NameBDBM50232352
Synonyms:CHEMBL4073888
TypeSmall organic molecule
Emp. Form.C21H23N3O4S
Mol. Mass.413.49
SMILESCN(C)Cc1c(C)n(c2ccccc12)S(=O)(=O)c1cccc(\C=C\C(=O)NO)c1