Reaction Details
TargetHistone deacetylase 2
LigandBDBM50232358
Substrate/Competitorn/a
Meas. Tech.ChEMBL_1646419 (CHEMBL3995475)
IC50>10000±n/a nM
Citation Nepali, KLee, HYLai, MJOjha, RWu, TYWu, GXChen, MCLiou, JP Ring-opened tetrahydro-¿-carbolines display cytotoxicity and selectivity with histone deacetylase isoforms. Eur J Med Chem127:115-127 (2017) 
 
Histone deacetylase 2
Name:Histone deacetylase 2
Type:Chromatin regulator; hydrolase; repressor
Mol. Mass.:55356.54
Organism:Homo sapiens (Human)
Description:Q92769
Residue:488
BDBM50232358
NameBDBM50232358
Synonyms:CHEMBL4096845
TypeSmall organic molecule
Emp. Form.C19H19N3O3
Mol. Mass.337.3725
SMILESCN(C)C(=O)c1cn(Cc2ccc(cc2)C(=O)NO)c2ccccc12