Reaction Details
TargetMelanocortin receptor 3
LigandBDBM50232405
Substrate/Competitorn/a
Meas. Tech.ChEMBL_1646492 (CHEMBL3995548)
EC50 40±n/a nM
Citation Ericson, MDFreeman, KTSchnell, SMHaskell-Luevano, C A Macrocyclic Agouti-Related Protein/[Nle J Med Chem60:805-813 (2017) 
 
Melanocortin receptor 3
Name:Melanocortin receptor 3
Type:PROTEIN
Mol. Mass.:35808.24
Organism:Mus musculus
Description:ChEMBL_1498848
Residue:323
BDBM50232405
NameBDBM50232405
Synonyms:CHEMBL4099127
TypeSmall organic molecule
Emp. Form.C48H63N15O8
Mol. Mass.978.1095
SMILESC[C@@H]1NC(=O)[C@H](CN)NC(=O)[C@H](Cc2c[nH]c3ccccc23)NC(=O)[C@H](CCCNC(N)=N)NC(=O)[C@@H](Cc2ccccc2)NC(=O)[C@H](Cc2cnc[nH]2)NC(=O)[C@@H]2CCCN2C(=O)[C@H]2CCCN2C1=O