Reaction Details
TargetMelanocortin receptor 5
LigandBDBM50232416
Substrate/Competitorn/a
Meas. Tech.ChEMBL_1646509 (CHEMBL3995565)
EC50 0.930000±n/a nM
Citation Ericson, MDFreeman, KTSchnell, SMHaskell-Luevano, C A Macrocyclic Agouti-Related Protein/[Nle J Med Chem60:805-813 (2017) 
 
Melanocortin receptor 5
Name:Melanocortin receptor 5
Type:Enzyme
Mol. Mass.:36612.92
Organism:Homo sapiens (Human)
Description:P33032
Residue:325
BDBM50232416
NameBDBM50232416
Synonyms:CHEMBL4061566
TypeSmall organic molecule
Emp. Form.C49H69N13O9
Mol. Mass.984.1539
SMILESCCCC[C@H](NC(C)=O)C(=O)N[C@H]1CC(=O)NCCCC[C@H](NC(=O)[C@H](Cc2c[nH]c3ccccc23)NC(=O)[C@H](CCCNC(N)=N)NC(=O)[C@@H](Cc2ccccc2)NC(=O)[C@@H]2CCCN2C1=O)C(N)=O