Reaction Details
TargetMelanocortin receptor 5
LigandBDBM50017181
Substrate/Competitorn/a
Meas. Tech.ChEMBL_1646494 (CHEMBL3995550)
EC50 0.110000±n/a nM
Citation Ericson, MDFreeman, KTSchnell, SMHaskell-Luevano, C A Macrocyclic Agouti-Related Protein/[Nle J Med Chem60:805-813 (2017) 
 
Melanocortin receptor 5
Name:Melanocortin receptor 5
Type:Enzyme
Mol. Mass.:36966.58
Organism:Mus musculus (Mouse)
Description:P41149
Residue:325
BDBM50017181
NameBDBM50017181
Synonyms:CHEMBL441738
TypeSmall organic molecule
Emp. Form.C78H111N21O19
Mol. Mass.1646.8452
SMILESCCCC[C@H](NC(=O)[C@H](CO)NC(=O)[C@H](Cc1ccc(O)cc1)NC(=O)[C@H](CO)NC(C)=O)C(=O)N[C@@H](CCC(O)=O)C(=O)N[C@@H](Cc1cnc[nH]1)C(=O)N[C@H](Cc1ccccc1)C(=O)N[C@@H](CCCNC(N)=N)C(=O)N[C@@H](Cc1c[nH]c2ccccc12)C(=O)NCC(=O)N[C@@H](CCCCN)C(=O)N1CCC[C@H]1C(=O)N[C@@H](C(C)C)C(N)=O