Reaction Details
TargetPhosphatidylinositol 4,5-bisphosphate 3-kinase catalytic subunit delta isoform
LigandBDBM50232434
Substrate/Competitorn/a
Meas. Tech.ChEMBL_1647788 (CHEMBL3996844)
IC50 1.2±n/a nM
Citation Qin, LYRuan, ZCherney, RJDhar, TGMNeels, JWeigelt, CASack, JSSrivastava, ASCornelius, LAMTino, JAStefanski, KGu, XXie, JSusulic, VYang, XYarde-Chinn, MSkala, SBosnius, RGoldstein, CDavies, PRuepp, SSalter-Cid, LBhide, RSPoss, MA Discovery of 7-(3-(piperazin-1-yl)phenyl)pyrrolo[2,1-f][1,2,4]triazin-4-amine derivatives as highly potent and selective PI3Kd inhibitors. Bioorg Med Chem Lett27:855-861 (2017) 
 
Phosphatidylinositol 4,5-bisphosphate 3-kinase catalytic subunit delta isoform
Name:Phosphatidylinositol 4,5-bisphosphate 3-kinase catalytic subunit delta isoform
Type:Enzyme Subunit
Mol. Mass.:119489.41
Organism:Homo sapiens (Human)
Description:O00329
Residue:1044
BDBM50232434
NameBDBM50232434
Synonyms:CHEMBL4091410 | US10214537, Example 252
TypeSmall organic molecule
Emp. Form.C31H33N9O2
Mol. Mass.563.6528
SMILESCC(=O)N1CCN(CC1c1cccnc1)c1cccc(c1)-c1cc(-c2ccnn2C2CCOCC2)c2c(N)ncnn12