Reaction Details
TargetPhosphatidylinositol 4,5-bisphosphate 3-kinase catalytic subunit delta isoform
LigandBDBM50232447
Substrate/Competitorn/a
Meas. Tech.ChEMBL_1647788 (CHEMBL3996844)
IC50 4.7±n/a nM
Citation Qin, LYRuan, ZCherney, RJDhar, TGMNeels, JWeigelt, CASack, JSSrivastava, ASCornelius, LAMTino, JAStefanski, KGu, XXie, JSusulic, VYang, XYarde-Chinn, MSkala, SBosnius, RGoldstein, CDavies, PRuepp, SSalter-Cid, LBhide, RSPoss, MA Discovery of 7-(3-(piperazin-1-yl)phenyl)pyrrolo[2,1-f][1,2,4]triazin-4-amine derivatives as highly potent and selective PI3Kd inhibitors. Bioorg Med Chem Lett27:855-861 (2017) 
 
Phosphatidylinositol 4,5-bisphosphate 3-kinase catalytic subunit delta isoform
Name:Phosphatidylinositol 4,5-bisphosphate 3-kinase catalytic subunit delta isoform
Type:Enzyme Subunit
Mol. Mass.:119489.41
Organism:Homo sapiens (Human)
Description:O00329
Residue:1044
BDBM50232447
NameBDBM50232447
Synonyms:CHEMBL4099020
TypeSmall organic molecule
Emp. Form.C24H29N9O
Mol. Mass.459.5468
SMILESCN1CCN(CC1)c1cc(ccn1)-c1cc(-c2ccnn2C2CCOCC2)c2c(N)ncnn12