Reaction Details
TargetMetabotropic glutamate receptor 5
LigandBDBM50232459
Substrate/Competitorn/a
Meas. Tech.ChEMBL_1647822 (CHEMBL3996878)
IC50 1210±n/a nM
Citation Gómez-Santacana, XDalton, JARRovira, XPin, JPGoudet, CGorostiza, PGiraldo, JLlebaria, A Positional isomers of bispyridine benzene derivatives induce efficacy changes on mGlu Eur J Med Chem127:567-576 (2017) 
 
Metabotropic glutamate receptor 5
Name:Metabotropic glutamate receptor 5
Type:Enzyme
Mol. Mass.:131900.14
Organism:Rattus norvegicus (Rat)
Description:P31424
Residue:1203
BDBM50232459
NameBDBM50232459
Synonyms:CHEMBL4094126
TypeSmall organic molecule
Emp. Form.C20H12N2
Mol. Mass.280.3227
SMILESc1ccc(nc1)C#Cc1ccc(cc1)C#Cc1ccccn1