Reaction Details
TargetMetabotropic glutamate receptor 5
LigandBDBM50084137
Substrate/Competitorn/a
Meas. Tech.ChEMBL_1647827 (CHEMBL3996883)
IC50 36±n/a nM
Citation Gómez-Santacana, XDalton, JARRovira, XPin, JPGoudet, CGorostiza, PGiraldo, JLlebaria, A Positional isomers of bispyridine benzene derivatives induce efficacy changes on mGlu Eur J Med Chem127:567-576 (2017) 
 
Metabotropic glutamate receptor 5
Name:Metabotropic glutamate receptor 5
Type:Enzyme
Mol. Mass.:132484.72
Organism:Homo sapiens (Human)
Description:n/a
Residue:1212
BDBM50084137
NameBDBM50084137
Synonyms:2-Methyl-6-(phenylethynyl)pyridine 2-Methyl-6-phenylethynyl-pyridine(MPEP) 2-methyl-6-(phenyl-ethynyl)pyridine 6-methyl-2-(2-phenylethynyl)pyridine CHEMBL66654 US10618900, No. MPEP | [3H]-2-methyl-6-(phenylethynyl)-pyridine
TypeSmall organic molecule
Emp. Form.C14H11N
Mol. Mass.193.2438
SMILESCc1cccc(n1)C#Cc1ccccc1