Reaction Details
TargetProstaglandin E2 receptor EP4 subtype
LigandBDBM50232548
Substrate/Competitorn/a
Meas. Tech.ChEBML_1648051
IC50 13±n/a nM
Citation Okumura, YYamagishi, TNukui, SNakao, K Discovery of AAT-008, a novel, potent, and selective prostaglandin EP4 receptor antagonist. Bioorg Med Chem Lett27:1186-1192 (2017) 
 
Prostaglandin E2 receptor EP4 subtype
Name:Prostaglandin E2 receptor EP4 subtype
Type:Enzyme
Mol. Mass.:53134.53
Organism:Homo sapiens (Human)
Description:P35408
Residue:488
BDBM50232548
NameBDBM50232548
Synonyms:CHEMBL4094572
TypeSmall organic molecule
Emp. Form.C22H16ClN3O4
Mol. Mass.421.833
SMILESC[C@H](NC(=O)c1cc(Cl)cnc1Oc1cccc(c1)C#N)c1ccc(cc1)C(O)=O