Reaction Details
TargetProstaglandin E2 receptor EP4 subtype
LigandBDBM50232544
Substrate/Competitorn/a
Meas. Tech.ChEMBL_1648051 (CHEMBL3997107)
IC50 16±n/a nM
Citation Okumura, YYamagishi, TNukui, SNakao, K Discovery of AAT-008, a novel, potent, and selective prostaglandin EP4 receptor antagonist. Bioorg Med Chem Lett27:1186-1192 (2017) 
 
Prostaglandin E2 receptor EP4 subtype
Name:Prostaglandin E2 receptor EP4 subtype
Type:Enzyme
Mol. Mass.:53134.53
Organism:Homo sapiens (Human)
Description:P35408
Residue:488
BDBM50232544
NameBDBM50232544
Synonyms:CHEMBL4099851
TypeSmall organic molecule
Emp. Form.C21H16ClFN2O4
Mol. Mass.414.814
SMILESC[C@H](NC(=O)c1cc(Cl)cnc1Oc1cccc(F)c1)c1ccc(cc1)C(O)=O