Reaction Details
TargetThromboxane A2 receptor
LigandBDBM50232544
Substrate/Competitorn/a
Meas. Tech.ChEBML_1648050
Ki>6000±n/a nM
Citation Okumura, YYamagishi, TNukui, SNakao, K Discovery of AAT-008, a novel, potent, and selective prostaglandin EP4 receptor antagonist. Bioorg Med Chem Lett27:1186-1192 (2017) 
 
Thromboxane A2 receptor
Name:Thromboxane A2 receptor
Type:Enyzme
Mol. Mass.:37445.28
Organism:Homo sapiens (Human)
Description:P21731
Residue:343
BDBM50232544
NameBDBM50232544
Synonyms:CHEMBL4099851
TypeSmall organic molecule
Emp. Form.C21H16ClFN2O4
Mol. Mass.414.814
SMILESC[C@H](NC(=O)c1cc(Cl)cnc1Oc1cccc(F)c1)c1ccc(cc1)C(O)=O