Reaction Details
TargetSerine/threonine-protein kinase PLK1
LigandBDBM50232584
Substrate/Competitorn/a
Meas. Tech.ChEBML_1648127
IC50 2.1±n/a nM
Citation Kiryanov, ANatala, SJones, BMcBride, CFeher, VLam, BLiu, YHonda, KUchiyama, NKawamoto, THikichi, YZhang, LHosfield, DSkene, RZou, HStafford, JCao, XIchikawa, T Structure-based design and SAR development of 5,6-dihydroimidazolo[1,5-f]pteridine derivatives as novel Polo-like kinase-1 inhibitors. Bioorg Med Chem Lett27:1311-1315 (2017) 
 
Serine/threonine-protein kinase PLK1
Name:Serine/threonine-protein kinase PLK1
Type:Serine/threonine-protein kinase
Mol. Mass.:68277.16
Organism:Homo sapiens (Human)
Description:P53350
Residue:603
BDBM50232584
NameBDBM50232584
Synonyms:CHEMBL4074112
TypeSmall organic molecule
Emp. Form.C32H42N8O4
Mol. Mass.602.7271
SMILESCCOC(=O)c1ncn-2c1[C@@H](CC)N(C1CCCC1)c1nc(Nc3ccc(cc3OC)C(=O)NC3CCN(C)CC3)ncc-21