Reaction Details
TargetNeuronal acetylcholine receptor subunit alpha-7
LigandBDBM50211215
Substrate/Competitorn/a
Meas. Tech.ChEBML_1648183
EC50 110±n/a nM
Citation Iwuagwu, CKing, DMcDonald, IMCook, JZusi, FCHill, MDMate, RAFang, HKnox, RGallagher, LPost-Munson Amy Easton, DMiller, RBenitex, YSiuciak, JLodge, NZaczek, RMorgan, DBristow, LMacor, JEOlson, RE Design and synthesis of a novel series of 4-heteroarylamino-1'-azaspiro[oxazole-5,3'-bicyclo[2.2.2]octanes asa7 nicotinic receptor agonists 2. Development of 4-heteroaryl SAR. Bioorg Med Chem Lett27:1261-1266 (2017) 
 
Neuronal acetylcholine receptor subunit alpha-7
Name:Neuronal acetylcholine receptor subunit alpha-7
Type:Enzyme
Mol. Mass.:56502.44
Organism:Rattus norvegicus (Rat)
Description:Q05941
Residue:502
BDBM50211215
NameBDBM50211215
Synonyms:CHEMBL3898922
TypeSmall organic molecule
Emp. Form.C14H18N4O
Mol. Mass.258.3189
SMILESC1N=C(Nc2ccccn2)O[C@]11CN2CCC1CC2