Reaction Details
TargetNeuronal acetylcholine receptor subunit alpha-3/beta-4
LigandBDBM50232597
Substrate/Competitorn/a
Meas. Tech.ChEMBL_1648187 (CHEMBL3997243)
EC50>100000±n/a nM
Citation Iwuagwu, CKing, DMcDonald, IMCook, JZusi, FCHill, MDMate, RAFang, HKnox, RGallagher, LPost-Munson Amy Easton, DMiller, RBenitex, YSiuciak, JLodge, NZaczek, RMorgan, DBristow, LMacor, JEOlson, RE Design and synthesis of a novel series of 4-heteroarylamino-1'-azaspiro[oxazole-5,3'-bicyclo[2.2.2]octanes asa7 nicotinic receptor agonists 2. Development of 4-heteroaryl SAR. Bioorg Med Chem Lett27:1261-1266 (2017) 
 
Neuronal acetylcholine receptor subunit alpha-3/beta-4
Name:Neuronal acetylcholine receptor subunit alpha-3/beta-4
Type:n/a
Mol. Mass.:n/a
Description:ASSAY_ID of ChEMBL is 1970247
Components:This complex has 2 components.
Component 1
Name:Neuronal acetylcholine receptor subunit beta-4
Synonyms:ACHB4_HUMAN Cholinergic, Nicotinic Alpha6Beta3Beta4Alpha5 Nicotinic acetylcholine receptor alpha6/alpha3/beta4
Type:Enzyme Catalytic Domain
Mol. Mass.:56388.51
Organism:Homo sapiens (Human)
Description:Cholinergic, Nicotinic Alpha6Beta3Beta4Alpha5 0 HUMAN::P30926
Residue:498
Component 2
Name:Neuronal acetylcholine receptor subunit alpha-3
Synonyms:ACHA3_HUMAN Cholinergic, Nicotinic Alpha3Beta2 Cholinergic, Nicotinic Alpha3Beta4x NACHRA3 Neuronal acetylcholine receptor subunit alpha-3 nicotinic central
Type:Enzyme Catalytic Domain
Mol. Mass.:57479.03
Organism:Homo sapiens (Human)
Description:Cholinergic, Nicotinic Alpha3Beta2 0 HUMAN::P32297
Residue:505
BDBM50232597
NameBDBM50232597
Synonyms:CHEMBL4092614
TypeSmall organic molecule
Emp. Form.C13H17N5O
Mol. Mass.259.307
SMILESC1N=C(Nc2cncnc2)O[C@]11CN2CCC1CC2