Reaction Details
Target5-hydroxytryptamine receptor 6
LigandBDBM35254
Substrate/Competitorn/a
Meas. Tech.ChEMBL_1648448 (CHEMBL3997504)
Ki 11±n/a nM
Citation Staron, JMordalski, SWarszycki, DSatala, GHogendorf, ABojarski, AJ Pyrano[2,3,4- ACS Med Chem Lett8:390-394 (2017) 
 
5-hydroxytryptamine receptor 6
Name:5-hydroxytryptamine receptor 6
Type:G Protein-Coupled Receptor (GPCR)
Mol. Mass.:46968.43
Organism:Homo sapiens (Human)
Description:P50406
Residue:440
BDBM35254
NameBDBM35254
Synonyms:2-methyl-4-(4-methylpiperazin-1-yl)-10H-thieno[2,3-b][1,5]benzodiazepine Olansek Zyprexa | olanzapine
TypeSmall organic molecule
Emp. Form.C17H20N4S
Mol. Mass.312.432
SMILESCN1CCN(CC1)C1=Nc2ccccc2Nc2sc(C)cc12