Reaction Details
TargetLysyl oxidase homolog 2
LigandBDBM50232678
Substrate/Competitorn/a
Meas. Tech.ChEMBL_1648493 (CHEMBL3997549)
IC50 128±n/a nM
Citation Hutchinson, JHRowbottom, MWLonergan, DDarlington, JProdanovich, PKing, CDEvans, JFBain, G Small Molecule Lysyl Oxidase-like 2 (LOXL2) Inhibitors: The Identification of an Inhibitor Selective for LOXL2 over LOX. ACS Med Chem Lett8:423-427 (2017) 
 
Lysyl oxidase homolog 2
Name:Lysyl oxidase homolog 2
Type:PROTEIN
Mol. Mass.:87003.17
Organism:Mus musculus
Description:ChEMBL_117436
Residue:776
BDBM50232678
NameBDBM50232678
Synonyms:CHEBI:27413 US10717734, Compound BAPN | US11098045, Compound BAPN
TypeSmall organic molecule
Emp. Form.C3H6N2
Mol. Mass.70.0931
SMILESNCCC#N