Reaction Details
TargetBeta-2 adrenergic receptor
LigandBDBM50232755
Substrate/Competitorn/a
Meas. Tech.ChEMBL_1648532 (CHEMBL3997588)
Ki 9.0±n/a nM
Citation Schmidt, DGunera, JBaker, JGKolb, P Similarity- and Substructure-Based Development of฿ ACS Med Chem Lett8:481-485 (2017) 
 
Beta-2 adrenergic receptor
Name:Beta-2 adrenergic receptor
Type:n/a
Mol. Mass.:46461.69
Organism:Homo sapiens (Human)
Description:P07550
Residue:413
BDBM50232755
NameBDBM50232755
Synonyms:CHEMBL4076830
TypeSmall organic molecule
Emp. Form.C19H19NO4
Mol. Mass.325.3585
SMILESCc1cc(O)c(CN2CCCC2)c2O\C(=C\c3ccco3)C(=O)c12