Reaction Details
TargetBeta-2 adrenergic receptor
LigandBDBM50347780
Substrate/Competitorn/a
Meas. Tech.ChEMBL_1648532 (CHEMBL3997588)
Ki 9.0±n/a nM
Citation Schmidt, DGunera, JBaker, JGKolb, P Similarity- and Substructure-Based Development of฿ ACS Med Chem Lett8:481-485 (2017) 
 
Beta-2 adrenergic receptor
Name:Beta-2 adrenergic receptor
Type:n/a
Mol. Mass.:46461.69
Organism:Homo sapiens (Human)
Description:P07550
Residue:413
BDBM50347780
NameBDBM50347780
Synonyms:CHEMBL1626224
TypeSmall organic molecule
Emp. Form.C17H21NO2
Mol. Mass.271.3541
SMILESCC(O)CNCCOc1ccccc1-c1ccccc1