Reaction Details
TargetNeuromedin-K receptor
LigandBDBM50232795
Substrate/Competitorn/a
Meas. Tech.ChEMBL_1648653 (CHEMBL3997709)
IC50 8.0±n/a nM
Citation Cheung, MBao, WBehm, DJBrooks, CABury, MJDowdell, SEEidam, HSFox, RMGoodman, KBHolt, DALee, DRoethke, TJWillette, RNXu, XYe, GThorneloe, KS Discovery of GSK2193874: An Orally Active, Potent, and Selective Blocker of Transient Receptor Potential Vanilloid 4. ACS Med Chem Lett8:549-554 (2017) 
 
Neuromedin-K receptor
Name:Neuromedin-K receptor
Type:Enzyme
Mol. Mass.:52221.96
Organism:Homo sapiens (Human)
Description:P29371
Residue:465
BDBM50232795
NameBDBM50232795
Synonyms:CHEMBL4092276
TypeSmall organic molecule
Emp. Form.C35H40N4O
Mol. Mass.532.7183
SMILESC[C@H](NC(=O)c1c(CN2CCC(CC2)N2CCCCC2)c(nc2ccccc12)-c1ccccc1)c1ccccc1