Reaction Details
TargetTransient receptor potential cation channel subfamily V member 4
LigandBDBM50232800
Substrate/Competitorn/a
Meas. Tech.ChEMBL_1648651 (CHEMBL3997707)
IC50 2.5±n/a nM
Citation Cheung, MBao, WBehm, DJBrooks, CABury, MJDowdell, SEEidam, HSFox, RMGoodman, KBHolt, DALee, DRoethke, TJWillette, RNXu, XYe, GThorneloe, KS Discovery of GSK2193874: An Orally Active, Potent, and Selective Blocker of Transient Receptor Potential Vanilloid 4. ACS Med Chem Lett8:549-554 (2017) 
 
Transient receptor potential cation channel subfamily V member 4
Name:Transient receptor potential cation channel subfamily V member 4
Type:PROTEIN
Mol. Mass.:98016.72
Organism:Rattus norvegicus
Description:ChEMBL_1514408
Residue:871
BDBM50232800
NameBDBM50232800
Synonyms:CHEMBL4103166
TypeSmall organic molecule
Emp. Form.C36H35BrF6N4O
Mol. Mass.733.584
SMILESFC(F)(F)[C@H](NC(=O)c1c(CN2CCC(CC2)N2CCCCC2)c(nc2ccc(Br)cc12)-c1cccc(c1)C(F)(F)F)c1ccccc1