Reaction Details
TargetFibroblast growth factor receptor 1
LigandBDBM50322535
Substrate/Competitorn/a
Meas. Tech.ChEMBL_1649217 (CHEMBL3998351)
IC50 2.2±n/a nM
Citation Cheng, WWang, MTian, XZhang, X An overview of the binding models of FGFR tyrosine kinases in complex with small molecule inhibitors. Eur J Med Chem126:476-490 (2017) 
 
Fibroblast growth factor receptor 1
Name:Fibroblast growth factor receptor 1
Type:Receptor
Mol. Mass.:91861.70
Organism:Homo sapiens (Human)
Description:P11362
Residue:822
BDBM50322535
NameBDBM50322535
Synonyms:3-(imidazo[1,2-b]pyridazin-3-ylethynyl)-4-methyl-N-{4-[(4-methylpiperazin-1-yl)methyl]-3-(trifluoromethyl)phenyl}benzamide CHEMBL1171837 US10464902, Ponatinib | US9255107, AP24534
TypeSmall organic molecule
Emp. Form.C29H27F3N6O
Mol. Mass.532.5595
SMILESCN1CCN(Cc2ccc(NC(=O)c3ccc(C)c(c3)C#Cc3cnc4cccnn34)cc2C(F)(F)F)CC1