Reaction Details
Target[Pyruvate dehydrogenase (acetyl-transferring)] kinase isozyme 2, mitochondrial
LigandBDBM227594
Substrate/Competitorn/a
Meas. Tech.ChEMBL_1649543 (CHEMBL3998677)
IC50 456±n/a nM
Citation Tso, SCLou, MWu, CYGui, WJChuang, JLMorlock, LKWilliams, NSWynn, RMQi, XChuang, DT Development of Dihydroxyphenyl Sulfonylisoindoline Derivatives as Liver-Targeting Pyruvate Dehydrogenase Kinase Inhibitors. J Med Chem60:1142-1150 (2017) 
 
[Pyruvate dehydrogenase (acetyl-transferring)] kinase isozyme 2, mitochondrial
Name:[Pyruvate dehydrogenase (acetyl-transferring)] kinase isozyme 2, mitochondrial
Type:Enzyme
Mol. Mass.:46153.78
Organism:Homo sapiens (Human)
Description:Q15119
Residue:407
BDBM227594
NameBDBM227594
Synonyms:PS10
TypeSmall organic molecule
Emp. Form.C14H13NO6S
Mol. Mass.323.321
SMILESOc1ccc(c(O)c1)S(=O)(=O)N1Cc2cc(O)cc(O)c2C1