Reaction Details
Target[Pyruvate dehydrogenase (acetyl-transferring)] kinase isozyme 2, mitochondrial
LigandBDBM50232926
Substrate/Competitorn/a
Meas. Tech.ChEMBL_1649543 (CHEMBL3998677)
IC50 65±n/a nM
Citation Tso, SCLou, MWu, CYGui, WJChuang, JLMorlock, LKWilliams, NSWynn, RMQi, XChuang, DT Development of Dihydroxyphenyl Sulfonylisoindoline Derivatives as Liver-Targeting Pyruvate Dehydrogenase Kinase Inhibitors. J Med Chem60:1142-1150 (2017) 
 
[Pyruvate dehydrogenase (acetyl-transferring)] kinase isozyme 2, mitochondrial
Name:[Pyruvate dehydrogenase (acetyl-transferring)] kinase isozyme 2, mitochondrial
Type:Enzyme
Mol. Mass.:46153.78
Organism:Homo sapiens (Human)
Description:Q15119
Residue:407
BDBM50232926
NameBDBM50232926
Synonyms:CHEMBL4080017
TypeSmall organic molecule
Emp. Form.C21H25N5O6S
Mol. Mass.475.518
SMILESN[C@@H](CC(N)=O)C(=O)N1CC(C1)Nc1ccc2CN(Cc2c1)S(=O)(=O)c1ccc(O)cc1O