Reaction Details
Target[Pyruvate dehydrogenase (acetyl-transferring)] kinase isozyme 4, mitochondrial
LigandBDBM50232913
Substrate/Competitorn/a
Meas. Tech.ChEMBL_1649546 (CHEMBL3998680)
IC50 284±n/a nM
Citation Tso, SCLou, MWu, CYGui, WJChuang, JLMorlock, LKWilliams, NSWynn, RMQi, XChuang, DT Development of Dihydroxyphenyl Sulfonylisoindoline Derivatives as Liver-Targeting Pyruvate Dehydrogenase Kinase Inhibitors. J Med Chem60:1142-1150 (2017) 
 
[Pyruvate dehydrogenase (acetyl-transferring)] kinase isozyme 4, mitochondrial
Name:[Pyruvate dehydrogenase (acetyl-transferring)] kinase isozyme 4, mitochondrial
Type:Enzyme
Mol. Mass.:46469.71
Organism:Homo sapiens (Human)
Description:Q16654
Residue:411
BDBM50232913
NameBDBM50232913
Synonyms:CHEMBL4103350
TypeSmall organic molecule
Emp. Form.C23H29N5O6S
Mol. Mass.503.571
SMILESN[C@@H](CC(N)=O)C(=O)N1CCC(CC1)Nc1ccc2CN(Cc2c1)S(=O)(=O)c1ccc(O)cc1O