Reaction Details
TargetCannabinoid receptor 1
LigandBDBM50232929
Substrate/Competitorn/a
Meas. Tech.ChEMBL_1649598 (CHEMBL3998732)
Ki>4000±n/a nM
Citation Ragusa, GGómez-Cañas, MMorales, PRodríguez-Cueto, CPazos, MRAsproni, BCichero, EFossa, PPinna, GAJagerovic, NFernández-Ruiz, JMurineddu, G New pyridazinone-4-carboxamides as new cannabinoid receptor type-2 inverse agonists: Synthesis, pharmacological data and molecular docking. Eur J Med Chem127:398-412 (2017) 
 
Cannabinoid receptor 1
Name:Cannabinoid receptor 1
Type:G Protein-Coupled Receptor (GPCR)
Mol. Mass.:52868.96
Organism:Homo sapiens (Human)
Description:P21554
Residue:472
BDBM50232929
NameBDBM50232929
Synonyms:CHEMBL4085733
TypeSmall organic molecule
Emp. Form.C26H27ClFN3O2
Mol. Mass.467.963
SMILESC[C@H]1CC[C@@H](CC1)NC(=O)c1cc(nn(Cc2ccc(F)cc2)c1=O)-c1ccc(Cl)c(C)c1