Reaction Details
TargetCannabinoid receptor 2
LigandBDBM50399157
Substrate/Competitorn/a
Meas. Tech.ChEMBL_1649599 (CHEMBL3998733)
Ki 11±n/a nM
Citation Ragusa, GGómez-Cañas, MMorales, PRodríguez-Cueto, CPazos, MRAsproni, BCichero, EFossa, PPinna, GAJagerovic, NFernández-Ruiz, JMurineddu, G New pyridazinone-4-carboxamides as new cannabinoid receptor type-2 inverse agonists: Synthesis, pharmacological data and molecular docking. Eur J Med Chem127:398-412 (2017) 
 
Cannabinoid receptor 2
Name:Cannabinoid receptor 2
Type:G Protein-Coupled Receptor (GPCR)
Mol. Mass.:39690.94
Organism:Homo sapiens (Human)
Description:P34972
Residue:360
BDBM50399157
NameBDBM50399157
Synonyms:CHEMBL2179724
TypeSmall organic molecule
Emp. Form.C27H42O3
Mol. Mass.414.6206
SMILESCCCCCCC(C)(C)c1cc(OC)c([C@H]2C=C(CO)[C@H]3C[C@@H]2C3(C)C)c(OC)c1