Reaction Details
TargetCannabinoid receptor 2
LigandBDBM50232934
Substrate/Competitorn/a
Meas. Tech.ChEMBL_1649599 (CHEMBL3998733)
Ki 13±n/a nM
Citation Ragusa, GGómez-Cañas, MMorales, PRodríguez-Cueto, CPazos, MRAsproni, BCichero, EFossa, PPinna, GAJagerovic, NFernández-Ruiz, JMurineddu, G New pyridazinone-4-carboxamides as new cannabinoid receptor type-2 inverse agonists: Synthesis, pharmacological data and molecular docking. Eur J Med Chem127:398-412 (2017) 
 
Cannabinoid receptor 2
Name:Cannabinoid receptor 2
Type:G Protein-Coupled Receptor (GPCR)
Mol. Mass.:39690.94
Organism:Homo sapiens (Human)
Description:P34972
Residue:360
BDBM50232934
NameBDBM50232934
Synonyms:CHEMBL4098746
TypeSmall organic molecule
Emp. Form.C23H29N3O2
Mol. Mass.379.4953
SMILESO=C(NC1CCCCCC1)c1cc(nn(C2CCCC2)c1=O)-c1ccccc1