Reaction Details
TargetCannabinoid receptor 1
LigandBDBM50232933
Substrate/Competitorn/a
Meas. Tech.ChEMBL_1649598 (CHEMBL3998732)
Ki 115±n/a nM
Citation Ragusa, GGómez-Cañas, MMorales, PRodríguez-Cueto, CPazos, MRAsproni, BCichero, EFossa, PPinna, GAJagerovic, NFernández-Ruiz, JMurineddu, G New pyridazinone-4-carboxamides as new cannabinoid receptor type-2 inverse agonists: Synthesis, pharmacological data and molecular docking. Eur J Med Chem127:398-412 (2017) 
 
Cannabinoid receptor 1
Name:Cannabinoid receptor 1
Type:G Protein-Coupled Receptor (GPCR)
Mol. Mass.:52868.96
Organism:Homo sapiens (Human)
Description:P21554
Residue:472
BDBM50232933
NameBDBM50232933
Synonyms:CHEMBL4094388
TypeSmall organic molecule
Emp. Form.C25H26FN3O2
Mol. Mass.419.4912
SMILESC[C@H]1CC[C@H](CC1)NC(=O)c1cc(nn(Cc2ccc(F)cc2)c1=O)-c1ccccc1