Reaction Details
TargetRetinoic acid receptor RXR-alpha
LigandBDBM50232945
Substrate/Competitorn/a
Meas. Tech.ChEMBL_1649602 (CHEMBL3998736)
Kd 138300±n/a nM
Citation Xu, DCai, LGuo, SXie, LYin, MChen, ZZhou, HSu, YZeng, ZZhang, X Virtual screening and experimental validation identify novel modulators of nuclear receptor RXRa from Drugbank database. Bioorg Med Chem Lett27:1055-1061 (2017) 
 
Retinoic acid receptor RXR-alpha
Name:Retinoic acid receptor RXR-alpha
Type:PROTEIN
Mol. Mass.:50820.38
Organism:Homo sapiens (Human)
Description:ChEMBL_1456363
Residue:462
BDBM50232945
NameBDBM50232945
Synonyms:CHEMBL4099830
TypeSmall organic molecule
Emp. Form.C25H20FNO2
Mol. Mass.385.4302
SMILESFc1ccc(cc1)-c1c(\C=C\C2CC=CC(=O)O2)c(nc2ccccc12)C1CC1