Reaction Details
TargetLysophosphatidic acid receptor 3
LigandBDBM50233165
Substrate/Competitorn/a
Meas. Tech.ChEMBL_1649814 (CHEMBL3998948)
EC50 290±n/a nM
Citation Banerjee, SNorman, DDLee, SCParrill, ALPham, TCBaker, DLTigyi, GJMiller, DD Highly Potent Non-Carboxylic Acid Autotaxin Inhibitors Reduce Melanoma Metastasis and Chemotherapeutic Resistance of Breast Cancer Stem Cells. J Med Chem60:1309-1324 (2017) 
 
Lysophosphatidic acid receptor 3
Name:Lysophosphatidic acid receptor 3
Type:Enzyme
Mol. Mass.:40149.72
Organism:Homo sapiens (Human)
Description:Q9UBY5
Residue:353
BDBM50233165
NameBDBM50233165
Synonyms:CHEMBL1222042
TypeSmall organic molecule
Emp. Form.C21H41O7P
Mol. Mass.436.5198
SMILESCCCCCCCC\C=C/CCCCCCCC(=O)OCC(O)COP(O)(O)=O