Reaction Details
TargetSodium channel protein type 2 subunit alpha
LigandBDBM50233221
Substrate/Competitorn/a
Meas. Tech.ChEMBL_1650112 (CHEMBL3999246)
IC50 170±n/a nM
Citation Tsukamoto, TChiba, YNakazaki, AIshikawa, YNakane, YCho, YYotsu-Yamashita, MNishikawa, TWakamori, MKonoki, K Inhibition of veratridine-induced delayed inactivation of the voltage-sensitive sodium channel by synthetic analogs of crambescin B. Bioorg Med Chem Lett27:1247-1251 (2017) 
 
Sodium channel protein type 2 subunit alpha
Name:Sodium channel protein type 2 subunit alpha
Type:Enzyme
Mol. Mass.:227954.68
Organism:Homo sapiens (Human)
Description:Q99250
Residue:2005
BDBM50233221
NameBDBM50233221
Synonyms:CHEMBL4064160
TypeSmall organic molecule
Emp. Form.C18H33N3O3
Mol. Mass.339.4729
SMILESCCCCCCCCCC[C@H]1NC(=N)N[C@@]2(CCCO2)[C@H]1C(O)=O