Reaction Details
TargetSodium channel protein type 2 subunit alpha
LigandBDBM50233224
Substrate/Competitorn/a
Meas. Tech.ChEMBL_1650112 (CHEMBL3999246)
IC50 2.0±n/a nM
Citation Tsukamoto, TChiba, YNakazaki, AIshikawa, YNakane, YCho, YYotsu-Yamashita, MNishikawa, TWakamori, MKonoki, K Inhibition of veratridine-induced delayed inactivation of the voltage-sensitive sodium channel by synthetic analogs of crambescin B. Bioorg Med Chem Lett27:1247-1251 (2017) 
 
Sodium channel protein type 2 subunit alpha
Name:Sodium channel protein type 2 subunit alpha
Type:Enzyme
Mol. Mass.:227954.68
Organism:Homo sapiens (Human)
Description:Q99250
Residue:2005
BDBM50233224
NameBDBM50233224
Synonyms:CHEMBL4070670
TypeSmall organic molecule
Emp. Form.C17H33N3O
Mol. Mass.295.4634
SMILESCCCCCCCCCC[C@H]1C[C@@]2(CCCO2)NC(=N)N1