Reaction Details
TargetReceptor-interacting serine/threonine-protein kinase 1
LigandBDBM50233225
Substrate/Competitorn/a
Meas. Tech.ChEMBL_1650179 (CHEMBL3999313)
IC50 2500±n/a nM
Citation Harris, PABerger, SBJeong, JUNagilla, RBandyopadhyay, DCampobasso, NCapriotti, CACox, JADare, LDong, XEidam, PMFinger, JNHoffman, SJKang, JKasparcova, VKing, BWLehr, RLan, YLeister, LKLich, JDMacDonald, TTMiller, NAOuellette, MTPao, CSRahman, AReilly, MARendina, ARRivera, EJSchaeffer, MCSehon, CASinghaus, RRSun, HHSwift, BATotoritis, RDVossenkämper, AWard, PWisnoski, DDZhang, DMarquis, RWGough, PJBertin, J Discovery of a First-in-Class Receptor Interacting Protein 1 (RIP1) Kinase Specific Clinical Candidate (GSK2982772) for the Treatment of Inflammatory Diseases. J Med Chem60:1247-1261 (2017) 
 
Receptor-interacting serine/threonine-protein kinase 1
Name:Receptor-interacting serine/threonine-protein kinase 1
Type:PROTEIN
Mol. Mass.:74852.62
Organism:Mus musculus
Description:ChEMBL_116773
Residue:656
BDBM50233225
NameBDBM50233225
Synonyms:CHEMBL4071864
TypeSmall organic molecule
Emp. Form.C20H19N5O3
Mol. Mass.377.3966
SMILESCN1c2ccccc2OC[C@H](NC(=O)c2n[nH]c(Cc3ccccc3)n2)C1=O