Reaction Details
TargetAmine oxidase [flavin-containing] A
LigandBDBM50036514
Substrate/Competitorn/a
Meas. Tech.ChEMBL_1650377 (CHEMBL3999511)
Ki 1840±n/a nM
Citation Lee, HWRyu, HWKang, MGPark, DOh, SRKim, H Selective inhibition of monoamine oxidase A by purpurin, an anthraquinone. Bioorg Med Chem Lett27:1136-1140 (2017) 
 
Amine oxidase [flavin-containing] A
Name:Amine oxidase [flavin-containing] A
Type:Protein
Mol. Mass.:59689.53
Organism:Homo sapiens (Human)
Description:P21397
Residue:527
BDBM50036514
NameBDBM50036514
Synonyms:CHEMBL3353566
TypeSmall organic molecule
Emp. Form.C12H12N2O2S
Mol. Mass.248.301
SMILESCNc1ccccc1-c1nc(cs1)C(=O)OC