Reaction Details
TargetSteroid hormone receptor ERR2
LigandBDBM50233267
Substrate/Competitorn/a
Meas. Tech.ChEMBL_1650379 (CHEMBL3999513)
IC50 350±n/a nM
Citation Yu, DDHuss, JMLi, HForman, BM Identification of novel inverse agonists of estrogen-related receptors ERR¿ and ERRß. Bioorg Med Chem25:1585-1599 (2017) 
 
Steroid hormone receptor ERR2
Name:Steroid hormone receptor ERR2
Type:PROTEIN
Mol. Mass.:48061.77
Organism:Homo sapiens (Human)
Description:ChEMBL_11254
Residue:433
BDBM50233267
NameBDBM50233267
Synonyms:CHEMBL4084142
TypeSmall organic molecule
Emp. Form.C28H31NO4
Mol. Mass.445.55
SMILESCOC(=O)CC\C(=C(/c1ccc(O)cc1)c1ccc(OCCN(C)C)cc1)c1ccccc1